Target
Induced myeloid leukemia cell differentiation protein Mcl-1
Ligand
BDBM50654
Substrate
Meas. Tech.
Dose Response Confirmation for Mcl-1/Noxa Interaction Inhibitors
IC50
7344.94377±n/a nM
Citation
 PubChem, PC Dose Response Confirmation for Mcl-1/Noxa Interaction Inhibitors PubChem Bioassay (2008)[AID] 
Target
Name:
Induced myeloid leukemia cell differentiation protein Mcl-1
Synonyms:
BCL2L3 Bcl-2-like protein 3 (Mcl-1) Bcl2-L-3 MCL1 Mcl-1 Myeloid cell leukemia sequence 1 (BCL2-related) | mcl1/EAT
Type:
Membrane; Single-pass membrane protein
Mol. Mass.:
37332.87
Organism:
Homo sapiens (Human)
Description:
Q07820
Residue:
350
  
Inhibitor
Name:
BDBM50654
Synonyms:
2-amino-9-(3,4-dihydroxy-5-methylol-tetrahydrofuran-2-yl)-3H-purine-6-thione 2-amino-9-[3,4-dihydroxy-5-(hydroxymethyl)oxolan-2-yl]-3H-purine-6-thione 6-Thioguanosine MLS000738229 cid_3938248
Type:
Small organic molecule
Emp. Form.:
C10H13N5O4S
Mol. Mass.:
299.306
SMILES:
Nc1nc2n(cnc2c(=S)[nH]1)C1OC(CO)C(O)C1O
: