Target
Glycoprotein 42
Ligand
BDBM51191
Substrate
Meas. Tech.
Dose Response Confirmation for Small Molecule Inhibitors of Epstein-Barr Virus
IC50
2340±n/a nM
Citation
 PubChem, PC Dose Response Confirmation for Small Molecule Inhibitors of Epstein-Barr Virus PubChem Bioassay (2008)[AID] 
Target
Name:
Glycoprotein 42
Synonyms:
BZLF2 | GP42_EBVA8
Type:
Enzyme Catalytic Domain
Mol. Mass.:
25424.12
Organism:
Human herpesvirus 4 type 2
Description:
gi_139424501
Residue:
223
  
Inhibitor
Name:
BDBM51191
Synonyms:
(Z)-[2-keto-4-(3-methylpyridin-1-ium-1-yl)-3-thiazolin-5-ylidene]methanolate (Z)-[4-(3-methylpyridin-1-ium-1-yl)-2-oxidanylidene-1,3-thiazol-5-ylidene]methanolate MLS000710654 cid_16195045
Type:
Small organic molecule
Emp. Form.:
C10H8N2O2S
Mol. Mass.:
220.248
SMILES:
Cc1ccc[n+](c1)-c1[n-]c(=O)sc1C=O
: