Target
Glycoprotein 42
Ligand
BDBM48877
Substrate
Meas. Tech.
Dose Response Confirmation for Small Molecule Inhibitors of Epstein-Barr Virus
IC50
1530±n/a nM
Citation
 PubChem, PC Dose Response Confirmation for Small Molecule Inhibitors of Epstein-Barr Virus PubChem Bioassay (2008)[AID] 
Target
Name:
Glycoprotein 42
Synonyms:
BZLF2 | GP42_EBVA8
Type:
Enzyme Catalytic Domain
Mol. Mass.:
25424.12
Organism:
Human herpesvirus 4 type 2
Description:
gi_139424501
Residue:
223
  
Inhibitor
Name:
BDBM48877
Synonyms:
3-[({[2-(4-fluorophenyl)-5H-chromeno[2,3-d]pyrimidin-4-yl]thio}acetyl)amino]benzoic acid 3-[[2-[[2-(4-fluorophenyl)-5H-[1]benzopyrano[2,3-d]pyrimidin-4-yl]thio]-1-oxoethyl]amino]benzoic acid 3-[[2-[[2-(4-fluorophenyl)-5H-chromeno[2,3-d]pyrimidin-4-yl]thio]acetyl]amino]benzoic acid SMR000314287 | cid_2137364
Type:
Small organic molecule
Emp. Form.:
C26H18FN3O4S
Mol. Mass.:
487.502
SMILES:
OC(=O)c1cccc(NC(=O)CSc2nc(nc3Oc4ccccc4Cc23)-c2ccc(F)cc2)c1
: