Target
DNA repair protein RAD51 homolog 1
Ligand
BDBM51368
Substrate
Meas. Tech.
Homologous recombination_Rad 51_dose response_2
IC50
53000±n/a nM
Citation
 PubChem, PC Homologous recombination_Rad 51_dose response_2 PubChem Bioassay (2008)[AID] 
Target
Name:
DNA repair protein RAD51 homolog 1
Synonyms:
RAD51 RAD51_HUMAN | RECA
Type:
Enzyme Catalytic Domain
Mol. Mass.:
36960.74
Organism:
Homo sapiens (Human)
Description:
gi_49168602
Residue:
339
  
Inhibitor
Name:
BDBM51368
Synonyms:
2-[[2-[[4-amino-5-(3-pyridinyl)-1,2,4-triazol-3-yl]thio]-1-oxoethyl]amino]benzoic acid methyl ester MLS001005868 cid_2388246 methyl 2-[[2-[(4-amino-5-pyridin-3-yl-1,2,4-triazol-3-yl)sulfanyl]acetyl]amino]benzoate
Type:
Small organic molecule
Emp. Form.:
C17H16N6O3S
Mol. Mass.:
384.412
SMILES:
COC(=O)c1ccccc1NC(=O)CSc1nnc(-c2cccnc2)n1N
: