Target
Alkaline phosphatase, tissue-nonspecific isozyme
Ligand
BDBM43801
Substrate
Meas. Tech.
SAR assay for compounds activating TNAP in the presence of 100 mM DEA performed in a luminescence assay
EC50
14000±n/a nM
Citation
 PubChem, PC SAR assay for compounds activating TNAP in the presence of 100 mM DEA performed in a luminescence assay PubChem Bioassay (2009)[AID] 
Target
Name:
Alkaline phosphatase, tissue-nonspecific isozyme
Synonyms:
ALPL tissue-nonspecific alkaline phosphatase precursor
Type:
PROTEIN
Mol. Mass.:
57306.17
Organism:
Homo sapiens (Human)
Description:
ChEMBL_1448917
Residue:
524
  
Inhibitor
Name:
BDBM43801
Synonyms:
2-nitro-N-[[(2-nitrobenzoyl)amino]carbamothioyl]benzamide 2-nitro-N-[[(2-nitrophenyl)carbonylamino]carbamothioyl]benzamide MLS-0106160.0001 | cid_3138362
Type:
Small organic molecule
Emp. Form.:
C15H11N5O6S
Mol. Mass.:
389.343
SMILES:
[O-][N+](=O)c1ccccc1C(=O)NNC(=S)NC(=O)c1ccccc1[N+]([O-])=O
: