Target
Alkaline phosphatase, tissue-nonspecific isozyme
Ligand
BDBM51418
Substrate
Meas. Tech.
SAR assay for compounds activating TNAP in the presence of 100 mM DEA performed in a luminescence assay
EC50
3350±n/a nM
Citation
 PubChem, PC SAR assay for compounds activating TNAP in the presence of 100 mM DEA performed in a luminescence assay PubChem Bioassay (2009)[AID] 
Target
Name:
Alkaline phosphatase, tissue-nonspecific isozyme
Synonyms:
ALPL tissue-nonspecific alkaline phosphatase precursor
Type:
PROTEIN
Mol. Mass.:
57306.17
Organism:
Homo sapiens (Human)
Description:
ChEMBL_1448917
Residue:
524
  
Inhibitor
Name:
BDBM51418
Synonyms:
3-(4-methoxyphenyl)-N-(1H-1,2,4-triazol-5-yl)propanamide MLS-0315838.0001 | cid_903249
Type:
Small organic molecule
Emp. Form.:
C12H14N4O2
Mol. Mass.:
246.2652
SMILES:
COc1ccc(CCC(=O)Nc2nnc[nH]2)cc1
: