Target
Ion channel NompC
Ligand
BDBM46913
Substrate
Meas. Tech.
Fluorescence counterscreen assay for TRPML3 agonists: dose response cell-based high-throughput screening assay to identify agonists of the transient receptor potential channel N1 (TRPN1)
EC50
29900±n/a nM
Citation
 PubChem, PC Fluorescence counterscreen assay for TRPML3 agonists: dose response cell-based high-throughput screening assay to identify agonists of the transient receptor potential channel N1 (TRPN1) PubChem Bioassay (2009)[AID] 
Target
Name:
Ion channel NompC
Synonyms:
transient receptor potential cation channel, subfamily N, member 1
Type:
Enzyme Catalytic Domain
Mol. Mass.:
175824.78
Organism:
Danio rerio
Description:
Q7T1G6
Residue:
1614
  
Inhibitor
Name:
BDBM46913
Synonyms:
2,4,6-trimethyl-N-(2-phenylphenyl)benzenesulfonamide N-2-biphenylyl-2,4,6-trimethylbenzenesulfonamide cid_1068533
Type:
Small organic molecule
Emp. Form.:
C21H21NO2S
Mol. Mass.:
351.462
SMILES:
Cc1cc(C)c(c(C)c1)S(=O)(=O)Nc1ccccc1-c1ccccc1
: