Target
Mitogen-activated protein kinase kinase kinase kinase 2
Ligand
BDBM51832
Substrate
Meas. Tech.
Dose Response Confirmation Screen via Multiplex HTS Assay for Inhibitors of MEK Kinase PB1 Domains, specifically MEK5 binding to MEK Kinase 2 Mutant
EC50
30000±n/a nM
Citation
 PubChem, PC Dose Response Confirmation Screen via Multiplex HTS Assay for Inhibitors of MEK Kinase PB1 Domains, specifically MEK5 binding to MEK Kinase 2 Mutant PubChem Bioassay (2009)[AID] 
Target
Name:
Mitogen-activated protein kinase kinase kinase kinase 2
Synonyms:
2.7.11.1 GC kinase Germinal center kinase MAP4K2 MEK kinase kinase 2 RAB8IP | Rab8-interacting protein
Type:
Mol. Mass.:
91551.35
Organism:
Homo sapiens (Human)
Description:
Residue:
820
  
Inhibitor
Name:
BDBM51832
Synonyms:
MLS000589651 cid_3757714
Type:
Small organic molecule
Emp. Form.:
C30H24N4
Mol. Mass.:
440.5384
SMILES:
N#CC(C#N)=c1ccc2=NC34CCCCC3C(C=C(N4c2c1)c1ccccc1)c1ccccc1
: