Target
Mitogen-activated protein kinase kinase kinase kinase 2
Ligand
BDBM39739
Substrate
Meas. Tech.
Dose Response Confirmation via Multiplex HTS Assay for Inhibitors of MEK Kinase PB1 Domains, specifically MEK5 binding to MEK Kinase 2 Wildtype
EC50
1870±n/a nM
Citation
 PubChem, PC Dose Response Confirmation via Multiplex HTS Assay for Inhibitors of MEK Kinase PB1 Domains, specifically MEK5 binding to MEK Kinase 2 Wildtype PubChem Bioassay (2009)[AID] 
Target
Name:
Mitogen-activated protein kinase kinase kinase kinase 2
Synonyms:
2.7.11.1 GC kinase Germinal center kinase MAP4K2 MEK kinase kinase 2 RAB8IP | Rab8-interacting protein
Type:
Mol. Mass.:
91551.35
Organism:
Homo sapiens (Human)
Description:
Residue:
820
  
Inhibitor
Name:
BDBM39739
Synonyms:
3-[2-[[(3Z)-3-benzylidene-2-morpholin-4-ylcyclopenten-1-yl]methylidene]hydrazinyl]-5-bromoindol-2-one 5-bromanyl-3-[2-[[(3Z)-2-morpholin-4-yl-3-(phenylmethylidene)cyclopenten-1-yl]methylidene]hydrazinyl]indol-2-one MLS000568929 cid_11834463
Type:
Small organic molecule
Emp. Form.:
C25H23BrN4O2
Mol. Mass.:
491.38
SMILES:
Brc1ccc2=NC(=O)C(NN=CC3=C(N4CCOCC4)C(CC3)=Cc3ccccc3)=c2c1
: