Target
Mitogen-activated protein kinase kinase kinase kinase 2
Ligand
BDBM51890
Substrate
Meas. Tech.
Dose Response Confirmation via Multiplex HTS Assay for Inhibitors of MEK Kinase PB1 Domains, specifically MEK5 binding to MEK Kinase 2 Wildtype
EC50
340±n/a nM
Citation
 PubChem, PC Dose Response Confirmation via Multiplex HTS Assay for Inhibitors of MEK Kinase PB1 Domains, specifically MEK5 binding to MEK Kinase 2 Wildtype PubChem Bioassay (2009)[AID] 
Target
Name:
Mitogen-activated protein kinase kinase kinase kinase 2
Synonyms:
2.7.11.1 GC kinase Germinal center kinase MAP4K2 MEK kinase kinase 2 RAB8IP | Rab8-interacting protein
Type:
Mol. Mass.:
91551.35
Organism:
Homo sapiens (Human)
Description:
Residue:
820
  
Inhibitor
Name:
BDBM51890
Synonyms:
MLS000911514 N-[4-[(4-ethylpiperazin-1-yl)methyl]-3-(trifluoromethyl)phenyl]-3-[[2-(1H-indol-3-yl)-2-oxidanylidene-ethanoyl]amino]-5-methoxy-benzamide N-[4-[(4-ethylpiperazino)methyl]-3-(trifluoromethyl)phenyl]-3-[[2-(1H-indol-3-yl)-2-keto-acetyl]amino]-5-methoxy-benzamide SMR000453564 | cid_16745813
Type:
Small organic molecule
Emp. Form.:
C32H32F3N5O4
Mol. Mass.:
607.6228
SMILES:
CCN1CCN(Cc2ccc(NC(=O)c3cc(NC(=O)C(=O)c4c[nH]c5ccccc45)cc(OC)c3)cc2C(F)(F)F)CC1
: