Target
Mitogen-activated protein kinase kinase kinase kinase 2
Ligand
BDBM51932
Substrate
Meas. Tech.
Dose Response Confirmation via Multiplex HTS Assay for Inhibitors of MEK Kinase PB1 Domains, specifically MEK5 binding to MEK Kinase 2 Wildtype
EC50
2260±n/a nM
Citation
 PubChem, PC Dose Response Confirmation via Multiplex HTS Assay for Inhibitors of MEK Kinase PB1 Domains, specifically MEK5 binding to MEK Kinase 2 Wildtype PubChem Bioassay (2009)[AID] 
Target
Name:
Mitogen-activated protein kinase kinase kinase kinase 2
Synonyms:
2.7.11.1 GC kinase Germinal center kinase MAP4K2 MEK kinase kinase 2 RAB8IP | Rab8-interacting protein
Type:
Mol. Mass.:
91551.35
Organism:
Homo sapiens (Human)
Description:
Residue:
820
  
Inhibitor
Name:
BDBM51932
Synonyms:
5-(4-chlorophenyl)-N-[4-(4-methyl-1-piperazinyl)phenyl]-2-furancarboxamide 5-(4-chlorophenyl)-N-[4-(4-methylpiperazino)phenyl]-2-furamide MLS001125449 cid_1494312
Type:
Small organic molecule
Emp. Form.:
C22H22ClN3O2
Mol. Mass.:
395.882
SMILES:
CN1CCN(CC1)c1ccc(NC(=O)c2ccc(o2)-c2ccc(Cl)cc2)cc1
: