Target
Beta-lactamase
Ligand
BDBM52031
Substrate
Meas. Tech.
Epi-absorbance-based dose response biochemical high throughput screening assay for selective inhibitors of VIM-2 metallo-beta-lactamase
IC50
13867±n/a nM
Citation
 PubChem, PC Epi-absorbance-based dose response biochemical high throughput screening assay for selective inhibitors of VIM-2 metallo-beta-lactamase PubChem Bioassay (2009)[AID] 
Target
Name:
Beta-lactamase
Synonyms:
Beta lactamase
Type:
Enzyme Catalytic Domain
Mol. Mass.:
31513.38
Organism:
Pseudomonas aeruginosa
Description:
gi_114881106
Residue:
286
  
Inhibitor
Name:
BDBM52031
Synonyms:
(2Z)-2-(phenylmethylidene)-6-(4-piperidin-1-ylpiperidin-1-yl)carbonyl-4H-1,4-benzothiazin-3-one (2Z)-2-benzylidene-6-(4-piperidin-1-ylpiperidine-1-carbonyl)-4H-1,4-benzothiazin-3-one MLS001030682 cid_24793641
Type:
Small organic molecule
Emp. Form.:
C26H29N3O2S
Mol. Mass.:
447.592
SMILES:
O=C(N1CCC(CC1)N1CCCCC1)c1ccc2S\C(=C/c3ccccc3)C(=O)Nc2c1
: