Target
Beta-lactamase
Ligand
BDBM52029
Substrate
Meas. Tech.
FRET-based counterscreen for selective VIM-2 inhibitors: dose response biochemical high throughput screening assay to identify epi-absorbance assay artifacts.
IC50
4442±n/a nM
Citation
 PubChem, PC FRET-based counterscreen for selective VIM-2 inhibitors: dose response biochemical high throughput screening assay to identify epi-absorbance assay artifacts. PubChem Bioassay (2009)[AID] 
Target
Name:
Beta-lactamase
Synonyms:
Beta lactamase
Type:
Enzyme Catalytic Domain
Mol. Mass.:
31513.38
Organism:
Pseudomonas aeruginosa
Description:
gi_114881106
Residue:
286
  
Inhibitor
Name:
BDBM52029
Synonyms:
(E)-3-([1,2,4]triazolo[3,4-a]phthalazin-3-yl)-2-propenoic acid (E)-3-([1,2,4]triazolo[3,4-a]phthalazin-3-yl)prop-2-enoic acid SMR000592707 | cid_2561818
Type:
Small organic molecule
Emp. Form.:
C12H8N4O2
Mol. Mass.:
240.2175
SMILES:
OC(=O)\C=C\c1nnc2c3ccccc3cnn12
: