Target
Zinc finger protein mex-5
Ligand
BDBM52067
Substrate
Meas. Tech.
Fluorescent Polarization Homogeneous Dose Response HTS to Indentify Inhibitors of Mex-5 Binding to TCR-2
EC50
300000±n/a nM
Citation
 PubChem, PC Fluorescent Polarization Homogeneous Dose Response HTS to Indentify Inhibitors of Mex-5 Binding to TCR-2 PubChem Bioassay (2009)[AID] 
Target
Name:
Zinc finger protein mex-5
Synonyms:
MEX5_CAEEL mex-5
Type:
Enzyme Catalytic Domain
Mol. Mass.:
52832.78
Organism:
Caenorhabditis elegans
Description:
gi_55976631
Residue:
468
  
Inhibitor
Name:
BDBM52067
Synonyms:
2-Amino-5-oxo-4-(2,3,4-trimethoxy-phenyl)-5,6,7,8-tetrahydro-4H-chromene-3-carbonitrile 2-amino-5-oxo-4-(2,3,4-trimethoxyphenyl)-4,6,7,8-tetrahydro-1-benzopyran-3-carbonitrile 2-azanyl-5-oxidanylidene-4-(2,3,4-trimethoxyphenyl)-4,6,7,8-tetrahydrochromene-3-carbonitrile SMR000011307 | cid_649019
Type:
Small organic molecule
Emp. Form.:
C19H20N2O5
Mol. Mass.:
356.3725
SMILES:
COc1ccc(C2C(C#N)C(=N)OC3=C2C(=O)CCC3)c(OC)c1OC
: