Target
Zinc finger protein mex-5
Ligand
BDBM52202
Substrate
Meas. Tech.
Fluorescent Polarization Homogeneous Dose Response HTS to Indentify Inhibitors of Mex-5 Binding to TCR-2
EC50
300000±n/a nM
Citation
 PubChem, PC Fluorescent Polarization Homogeneous Dose Response HTS to Indentify Inhibitors of Mex-5 Binding to TCR-2 PubChem Bioassay (2009)[AID] 
Target
Name:
Zinc finger protein mex-5
Synonyms:
MEX5_CAEEL mex-5
Type:
Enzyme Catalytic Domain
Mol. Mass.:
52832.78
Organism:
Caenorhabditis elegans
Description:
gi_55976631
Residue:
468
  
Inhibitor
Name:
BDBM52202
Synonyms:
2-amino-5-keto-7,7-dimethyl-4-(2,3,4-trimethoxyphenyl)-6,8-dihydro-4H-chromene-3-carbonitrile 2-amino-7,7-dimethyl-5-oxo-4-(2,3,4-trimethoxyphenyl)-6,8-dihydro-4H-chromene-3-carbonitrile MLS000104772 cid_2828669
Type:
Small organic molecule
Emp. Form.:
C21H24N2O5
Mol. Mass.:
384.4257
SMILES:
COc1ccc(C2C(C#N)C(=N)OC3=C2C(=O)CC(C)(C)C3)c(OC)c1OC
: