Target
Zinc finger protein mex-5
Ligand
BDBM52485
Substrate
Meas. Tech.
Fluorescent Polarization Homogeneous Dose Response HTS to Indentify Inhibitors of Mex-5 Binding to TCR-2
EC50
12820±n/a nM
Citation
 PubChem, PC Fluorescent Polarization Homogeneous Dose Response HTS to Indentify Inhibitors of Mex-5 Binding to TCR-2 PubChem Bioassay (2009)[AID] 
Target
Name:
Zinc finger protein mex-5
Synonyms:
MEX5_CAEEL mex-5
Type:
Enzyme Catalytic Domain
Mol. Mass.:
52832.78
Organism:
Caenorhabditis elegans
Description:
gi_55976631
Residue:
468
  
Inhibitor
Name:
BDBM52485
Synonyms:
5-(4-fluorophenyl)-7-(2-furanyl)-1,7-dihydro-[1,2,4]triazolo[1,5-a]pyrimidine 5-(4-fluorophenyl)-7-(2-furyl)-4,7-dihydro[1,2,4]triazolo[1,5-a]pyrimidine MLS000626960 cid_5736758
Type:
Small organic molecule
Emp. Form.:
C15H11FN4O
Mol. Mass.:
282.2724
SMILES:
Fc1ccc(cc1)C1=Nc2ncnn2C(C1)c1ccco1
: