Target
Zinc finger protein mex-5
Ligand
BDBM52496
Substrate
Meas. Tech.
Fluorescent Polarization Homogeneous Dose Response HTS to Indentify Inhibitors of Mex-5 Binding to TCR-2
EC50
113352±n/a nM
Citation
 PubChem, PC Fluorescent Polarization Homogeneous Dose Response HTS to Indentify Inhibitors of Mex-5 Binding to TCR-2 PubChem Bioassay (2009)[AID] 
Target
Name:
Zinc finger protein mex-5
Synonyms:
MEX5_CAEEL mex-5
Type:
Enzyme Catalytic Domain
Mol. Mass.:
52832.78
Organism:
Caenorhabditis elegans
Description:
gi_55976631
Residue:
468
  
Inhibitor
Name:
BDBM52496
Synonyms:
(E)-2-cyano-N-(4-ethylphenyl)-3-(7-methyl-2-morpholin-4-yl-quinolin-3-yl)prop-2-enamide (E)-2-cyano-N-(4-ethylphenyl)-3-(7-methyl-2-morpholino-3-quinolyl)acrylamide MLS000388606 cid_5688097
Type:
Small organic molecule
Emp. Form.:
C26H26N4O2
Mol. Mass.:
426.5102
SMILES:
CCc1ccc(NC(=O)C(=C\c2cc3ccc(C)cc3nc2N2CCOCC2)\C#N)cc1
: