Target
Zinc finger protein mex-5
Ligand
BDBM52614
Substrate
Meas. Tech.
Fluorescent Polarization Homogeneous Dose Response HTS to Indentify Inhibitors of Mex-5 Binding to TCR-2
EC50
300000±n/a nM
Citation
 PubChem, PC Fluorescent Polarization Homogeneous Dose Response HTS to Indentify Inhibitors of Mex-5 Binding to TCR-2 PubChem Bioassay (2009)[AID] 
Target
Name:
Zinc finger protein mex-5
Synonyms:
MEX5_CAEEL mex-5
Type:
Enzyme Catalytic Domain
Mol. Mass.:
52832.78
Organism:
Caenorhabditis elegans
Description:
gi_55976631
Residue:
468
  
Inhibitor
Name:
BDBM52614
Synonyms:
2-amino-4-(3,4-dimethoxyphenyl)-5-keto-4,6,7,8-tetrahydrochromene-3-carbonitrile 2-amino-4-(3,4-dimethoxyphenyl)-5-oxo-4,6,7,8-tetrahydrochromene-3-carbonitrile MLS000711681 cid_2737667
Type:
Small organic molecule
Emp. Form.:
C18H18N2O4
Mol. Mass.:
326.3465
SMILES:
COc1ccc(cc1OC)C1C(C#N)C(=N)OC2=C1C(=O)CCC2
: