Target
Zinc finger protein mex-5
Ligand
BDBM48122
Substrate
Meas. Tech.
Fluorescent Polarization Homogeneous Dose Response HTS to Indentify Inhibitors of Mex-5 Binding to TCR-2
EC50
16850±n/a nM
Citation
 PubChem, PC Fluorescent Polarization Homogeneous Dose Response HTS to Indentify Inhibitors of Mex-5 Binding to TCR-2 PubChem Bioassay (2009)[AID] 
Target
Name:
Zinc finger protein mex-5
Synonyms:
MEX5_CAEEL mex-5
Type:
Enzyme Catalytic Domain
Mol. Mass.:
52832.78
Organism:
Caenorhabditis elegans
Description:
gi_55976631
Residue:
468
  
Inhibitor
Name:
BDBM48122
Synonyms:
5-bromanyl-N-(1,5-dimethyl-3-oxidanylidene-2-phenyl-pyrazol-4-yl)-6-oxidanylidene-pyran-3-carboxamide 5-bromo-N-(1,5-dimethyl-3-oxo-2-phenyl-4-pyrazolyl)-6-oxo-3-pyrancarboxamide MLS000036865 cid_661972
Type:
Small organic molecule
Emp. Form.:
C17H14BrN3O4
Mol. Mass.:
404.215
SMILES:
Cc1c(NC(=O)c2coc(=O)c(Br)c2)c(=O)n(-c2ccccc2)n1C
: