Target
Zinc finger protein mex-5
Ligand
BDBM52755
Substrate
Meas. Tech.
Fluorescent Polarization Homogeneous Dose Response HTS to Indentify Inhibitors of Mex-5 Binding to TCR-2
EC50
300000±n/a nM
Citation
 PubChem, PC Fluorescent Polarization Homogeneous Dose Response HTS to Indentify Inhibitors of Mex-5 Binding to TCR-2 PubChem Bioassay (2009)[AID] 
Target
Name:
Zinc finger protein mex-5
Synonyms:
MEX5_CAEEL mex-5
Type:
Enzyme Catalytic Domain
Mol. Mass.:
52832.78
Organism:
Caenorhabditis elegans
Description:
gi_55976631
Residue:
468
  
Inhibitor
Name:
BDBM52755
Synonyms:
MLS001004059 N-[2-(2-cyano-4-nitroanilino)ethyl]acetamide SMR000377772 | cid_4841766
Type:
Small organic molecule
Emp. Form.:
C11H12N4O3
Mol. Mass.:
248.238
SMILES:
CC(=O)NCCNc1ccc(cc1C#N)[N+]([O-])=O
: