Target
POsterior Segregation
Ligand
BDBM50702
Substrate
Meas. Tech.
Fluorescent Polarization Homogeneous Dose Response HTS to Indentify Inhibitors of POS-1 Binding to mex-3-RNA
EC50
300000±n/a nM
Citation
 PubChem, PC Fluorescent Polarization Homogeneous Dose Response HTS to Indentify Inhibitors of POS-1 Binding to mex-3-RNA PubChem Bioassay (2009)[AID] 
Target
Name:
POsterior Segregation
Synonyms:
POsterior Segregation family member (pos-1)
Type:
Enzyme Catalytic Domain
Mol. Mass.:
29838.90
Organism:
Caenorhabditis elegans
Description:
gi_17562800
Residue:
264
  
Inhibitor
Name:
BDBM50702
Synonyms:
MLS000778776 Sodium; 7-oxo-10-oxy-7H-phenoxazin-3-olate sodium;10-oxidanidyl-7-oxidanylidene-phenoxazin-10-ium-3-olate sodium;10-oxido-7-oxophenoxazin-10-ium-3-olate | sodium;7-keto-10-oxido-phenoxazin-10-ium-3-olate
Type:
Small organic molecule
Emp. Form.:
C12H6NO4
Mol. Mass.:
228.1809
SMILES:
[O-]c1ccc2[n+]([O-])c3ccc(=O)cc3oc2c1
: