Target
POsterior Segregation
Ligand
BDBM32021
Substrate
Meas. Tech.
Fluorescent Polarization Homogeneous Dose Response HTS to Indentify Inhibitors of POS-1 Binding to mex-3-RNA
EC50
29176±n/a nM
Citation
 PubChem, PC Fluorescent Polarization Homogeneous Dose Response HTS to Indentify Inhibitors of POS-1 Binding to mex-3-RNA PubChem Bioassay (2009)[AID] 
Target
Name:
POsterior Segregation
Synonyms:
POsterior Segregation family member (pos-1)
Type:
Enzyme Catalytic Domain
Mol. Mass.:
29838.90
Organism:
Caenorhabditis elegans
Description:
gi_17562800
Residue:
264
  
Inhibitor
Name:
BDBM32021
Synonyms:
4,5-bis(oxidanyl)-9,10-bis(oxidanylidene)anthracene-2-carboxylic acid 4,5-dihydroxy-9,10-dioxo-2-anthracenecarboxylic acid MLS000069639 SMR000058210 US9238626, Rhein | cid_10168
Type:
Small organic molecule
Emp. Form.:
C15H8O6
Mol. Mass.:
284.2204
SMILES:
OC(=O)c1cc(O)c2C(=O)c3c(O)cccc3C(=O)c2c1
: