Target
POsterior Segregation
Ligand
BDBM52551
Substrate
Meas. Tech.
Fluorescent Polarization Homogeneous Dose Response HTS to Indentify Inhibitors of POS-1 Binding to mex-3-RNA
EC50
300000±n/a nM
Citation
 PubChem, PC Fluorescent Polarization Homogeneous Dose Response HTS to Indentify Inhibitors of POS-1 Binding to mex-3-RNA PubChem Bioassay (2009)[AID] 
Target
Name:
POsterior Segregation
Synonyms:
POsterior Segregation family member (pos-1)
Type:
Enzyme Catalytic Domain
Mol. Mass.:
29838.90
Organism:
Caenorhabditis elegans
Description:
gi_17562800
Residue:
264
  
Inhibitor
Name:
BDBM52551
Synonyms:
2-amino-4-(3,4-dimethoxyphenyl)-5-keto-7,7-dimethyl-6,8-dihydro-4H-chromene-3-carbonitrile 2-amino-4-(3,4-dimethoxyphenyl)-7,7-dimethyl-5-oxo-6,8-dihydro-4H-chromene-3-carbonitrile MLS000711869 cid_2828654
Type:
Small organic molecule
Emp. Form.:
C20H22N2O4
Mol. Mass.:
354.3997
SMILES:
COc1ccc(cc1OC)C1C(C#N)C(=N)OC2=C1C(=O)CC(C)(C)C2
: