Target
POsterior Segregation
Ligand
BDBM52635
Substrate
Meas. Tech.
Fluorescent Polarization Homogeneous Dose Response HTS to Indentify Inhibitors of POS-1 Binding to mex-3-RNA
EC50
69710±n/a nM
Citation
 PubChem, PC Fluorescent Polarization Homogeneous Dose Response HTS to Indentify Inhibitors of POS-1 Binding to mex-3-RNA PubChem Bioassay (2009)[AID] 
Target
Name:
POsterior Segregation
Synonyms:
POsterior Segregation family member (pos-1)
Type:
Enzyme Catalytic Domain
Mol. Mass.:
29838.90
Organism:
Caenorhabditis elegans
Description:
gi_17562800
Residue:
264
  
Inhibitor
Name:
BDBM52635
Synonyms:
2-amino-4-(4-methoxyphenyl)-7,7-dimethyl-5-oxo-6,8-dihydro-4H-1-benzopyran-3-carbonitrile 2-amino-5-keto-4-(4-methoxyphenyl)-7,7-dimethyl-6,8-dihydro-4H-chromene-3-carbonitrile MLS000718331 cid_2839615
Type:
Small organic molecule
Emp. Form.:
C19H20N2O3
Mol. Mass.:
324.3737
SMILES:
COc1ccc(cc1)C1C(C#N)C(=N)OC2=C1C(=O)CC(C)(C)C2
: