Target
POsterior Segregation
Ligand
BDBM52742
Substrate
Meas. Tech.
Fluorescent Polarization Homogeneous Dose Response HTS to Indentify Inhibitors of POS-1 Binding to mex-3-RNA
EC50
24445±n/a nM
Citation
 PubChem, PC Fluorescent Polarization Homogeneous Dose Response HTS to Indentify Inhibitors of POS-1 Binding to mex-3-RNA PubChem Bioassay (2009)[AID] 
Target
Name:
POsterior Segregation
Synonyms:
POsterior Segregation family member (pos-1)
Type:
Enzyme Catalytic Domain
Mol. Mass.:
29838.90
Organism:
Caenorhabditis elegans
Description:
gi_17562800
Residue:
264
  
Inhibitor
Name:
BDBM52742
Synonyms:
MLS000562620 SMR000391115 | cid_16196522
Type:
Small organic molecule
Emp. Form.:
C43H73ClN16O6
Mol. Mass.:
945.596
SMILES:
Cl.CC[C@H](C)[C@@H](C(=O)N1CCN(CC1)c1nc(NCCOCCOCCOCC#C)nc(n1)N1CCN(CC1)C(=O)[C@H]([C@@H](C)CC)n1cc(nn1)[C@@H](N)CC(C)C)n1cc(nn1)[C@@H](N)CO
: