Target
Integrin alpha-4
Ligand
BDBM37694
Substrate
Meas. Tech.
Dose-Response of Allosteric Antagonists for the VLA-4 Integrin
EC50
2840±n/a nM
Citation
 PubChem, PC Dose-Response of Allosteric Antagonists for the VLA-4 Integrin PubChem Bioassay (2007)[AID] 
Target
Name:
Integrin alpha-4
Synonyms:
CD49 antigen-like family member D CD49d antigen ITA4_HUMAN Integrin alpha-4 Integrin alpha-IV VLA-4 integrin alpha 4 precursor | integrin alpha-4 precursor
Type:
Membrane Protein
Mol. Mass.:
114897.35
Organism:
Homo sapiens (Human)
Description:
P13612
Residue:
1032
  
Inhibitor
Name:
BDBM37694
Synonyms:
5-(2,4-dimethoxyphenyl)-N-(4-methoxy-1,3-benzothiazol-2-yl)-1,3,4-oxadiazol-2-amine SMR000016519 cid_3237187
Type:
Small organic molecule
Emp. Form.:
C18H16N4O4S
Mol. Mass.:
384.409
SMILES:
COc1ccc(-c2nnc(Nc3nc4c(OC)cccc4s3)o2)c(OC)c1
: