Target
Integrin alpha-4
Ligand
BDBM39871
Substrate
Meas. Tech.
Dose-Response of Allosteric Antagonists for the VLA-4 Integrin
EC50
6500±n/a nM
Citation
 PubChem, PC Dose-Response of Allosteric Antagonists for the VLA-4 Integrin PubChem Bioassay (2007)[AID] 
Target
Name:
Integrin alpha-4
Synonyms:
CD49 antigen-like family member D CD49d antigen ITA4_HUMAN Integrin alpha-4 Integrin alpha-IV VLA-4 integrin alpha 4 precursor | integrin alpha-4 precursor
Type:
Membrane Protein
Mol. Mass.:
114897.35
Organism:
Homo sapiens (Human)
Description:
P13612
Residue:
1032
  
Inhibitor
Name:
BDBM39871
Synonyms:
3-butyl-2-keto-5-(morpholinomethyl)tetrahydrofuran-3-carboxylic acid ethyl ester MLS000037648 cid_661019 ethyl 3-butyl-5-(morpholin-4-ylmethyl)-2-oxooxolane-3-carboxylate
Type:
Small organic molecule
Emp. Form.:
C16H27NO5
Mol. Mass.:
313.3893
SMILES:
CCCCC1(CC(CN2CCOCC2)OC1=O)C(=O)OCC
: