Target
Mannose-6-phosphate isomerase
Ligand
BDBM34643
Substrate
Meas. Tech.
HTS identification of compounds inhibiting phosphomannose isomerase (PMI) via a fluorescence intensity assay.
IC50
50000±n/a nM
Citation
 PubChem, PC HTS identification of compounds inhibiting phosphomannose isomerase (PMI) via a fluorescence intensity assay. PubChem Bioassay (2009)[AID] 
Target
Name:
Mannose-6-phosphate isomerase
Synonyms:
MPI MPI_HUMAN PMI1
Type:
PROTEIN
Mol. Mass.:
46651.35
Organism:
Homo sapiens (Human)
Description:
ChEMBL_1448919
Residue:
423
  
Inhibitor
Name:
BDBM34643
Synonyms:
3-(2-carboxyethylamino)-2-naphthalenecarboxylic acid 3-(2-carboxyethylamino)naphthalene-2-carboxylic acid MLS000104959 cid_767169
Type:
Small organic molecule
Emp. Form.:
C14H13NO4
Mol. Mass.:
259.2573
SMILES:
OC(=O)CCNc1cc2ccccc2cc1C(O)=O
: