Target
Mannose-6-phosphate isomerase
Ligand
BDBM34704
Substrate
Meas. Tech.
HTS identification of compounds inhibiting phosphomannose isomerase (PMI) via a fluorescence intensity assay.
IC50
50000±n/a nM
Citation
 PubChem, PC HTS identification of compounds inhibiting phosphomannose isomerase (PMI) via a fluorescence intensity assay. PubChem Bioassay (2009)[AID] 
Target
Name:
Mannose-6-phosphate isomerase
Synonyms:
MPI MPI_HUMAN PMI1
Type:
PROTEIN
Mol. Mass.:
46651.35
Organism:
Homo sapiens (Human)
Description:
ChEMBL_1448919
Residue:
423
  
Inhibitor
Name:
BDBM34704
Synonyms:
MLS000566323 cid_1189783
Type:
Small organic molecule
Emp. Form.:
C24H22N2O4
Mol. Mass.:
402.4425
SMILES:
CCOC(=O)c1c(C)oc2c1c1CN(Cc3ccccn3)COc1c1ccccc21
: