Target
M1 family aminopeptidase
Ligand
BDBM53947
Substrate
Meas. Tech.
Inhibitors of Plasmodium falciparum M1- Family Alanyl Aminopeptidase (M1AAP)
IC50
3370±n/a nM
Citation
 PubChem, PC Inhibitors of Plasmodium falciparum M1- Family Alanyl Aminopeptidase (M1AAP) PubChem Bioassay (2008)[AID] 
Target
Name:
M1 family aminopeptidase
Synonyms:
AMPN_PLAF7 Zinc aminopeptidase | m1-family aminopeptidase
Type:
PROTEIN
Mol. Mass.:
126072.31
Organism:
Plasmodium falciparum (isolate FcB1 / Columbia)
Description:
ChEMBL_735637
Residue:
1085
  
Inhibitor
Name:
BDBM53947
Synonyms:
4-[(N'E)-N'-(6-ketocyclohexa-2,4-dien-1-ylidene)hydrazino]-5-methyl-2-[4-(p-tolyl)thiazol-2-yl]-2-pyrazolin-3-one 5-methyl-2-[4-(4-methylphenyl)-1,3-thiazol-2-yl]-4-[(2E)-2-(6-oxocyclohexa-2,4-dien-1-ylidene)hydrazinyl]-4H-pyrazol-3-one MLS000713300 cid_5720147
Type:
Small organic molecule
Emp. Form.:
C20H17N5O2S
Mol. Mass.:
391.446
SMILES:
Cc1[nH]n(-c2nc(cs2)-c2ccc(C)cc2)c(=O)c1N=Nc1ccccc1O
: