Target
Nucleotide-binding oligomerization domain-containing protein 2
Ligand
BDBM54227
Substrate
Meas. Tech.
uHTS luminescence assay for the identification of compounds that inhibit NOD2 in MDP treated cells
IC50
1738±n/a nM
Citation
 PubChem, PC uHTS luminescence assay for the identification of compounds that inhibit NOD2 in MDP treated cells PubChem Bioassay (2010)[AID] 
Target
Name:
Nucleotide-binding oligomerization domain-containing protein 2
Synonyms:
CARD15 IBD1 NOD2 Nucleotide-binding oligomerization domain-containing protein 2 | nucleotide-binding oligomerization domain containing 2
Type:
PROTEIN
Mol. Mass.:
115287.18
Organism:
Homo sapiens (Human)
Description:
ChEMBL_1454053
Residue:
1040
  
Inhibitor
Name:
BDBM54227
Synonyms:
3-(6-Bromo-3-ethyl-2-methyl-quinolin-4-ylsulfanyl)-propionitrile 3-(6-bromo-3-ethyl-2-methylquinolin-4-yl)sulfanylpropanenitrile 3-[(6-bromo-3-ethyl-2-methyl-4-quinolyl)thio]propionitrile SMR000218463 | cid_1858684
Type:
Small organic molecule
Emp. Form.:
C15H15BrN2S
Mol. Mass.:
335.262
SMILES:
CCc1c(C)nc2ccc(Br)cc2c1SCCC#N
: