Target
Nucleotide-binding oligomerization domain-containing protein 2
Ligand
BDBM50737
Substrate
Meas. Tech.
uHTS luminescence assay for the identification of compounds that inhibit NOD2 in MDP treated cells
IC50
5932±n/a nM
Citation
 PubChem, PC uHTS luminescence assay for the identification of compounds that inhibit NOD2 in MDP treated cells PubChem Bioassay (2010)[AID] 
Target
Name:
Nucleotide-binding oligomerization domain-containing protein 2
Synonyms:
CARD15 IBD1 NOD2 Nucleotide-binding oligomerization domain-containing protein 2 | nucleotide-binding oligomerization domain containing 2
Type:
PROTEIN
Mol. Mass.:
115287.18
Organism:
Homo sapiens (Human)
Description:
ChEMBL_1454053
Residue:
1040
  
Inhibitor
Name:
BDBM50737
Synonyms:
4-[(5Z)-4-keto-5-[(E)-2-methyl-3-phenyl-prop-2-enylidene]-2-thioxo-thiazolidin-3-yl]benzoic acid 4-[(5Z)-5-[(E)-2-methyl-3-phenylprop-2-enylidene]-4-oxo-2-sulfanylidene-1,3-thiazolidin-3-yl]benzoic acid 4-{5-[(E)-2-Methyl-3-phenyl-prop-2-en-(Z)-ylidene]-4-oxo-2-thioxo-thiazolidin-3-yl}-benzoic acid SMR000414808 | cid_1608030
Type:
Small organic molecule
Emp. Form.:
C20H15NO3S2
Mol. Mass.:
381.468
SMILES:
C\C(\C=C1/SC(=S)N(C1=O)c1ccc(cc1)C(O)=O)=C/c1ccccc1
: