Target
Nucleotide-binding oligomerization domain-containing protein 2
Ligand
BDBM50227494
Substrate
Meas. Tech.
uHTS luminescence assay for the identification of compounds that inhibit NOD2 in MDP treated cells
IC50
1832±n/a nM
Citation
 PubChem, PC uHTS luminescence assay for the identification of compounds that inhibit NOD2 in MDP treated cells PubChem Bioassay (2010)[AID] 
Target
Name:
Nucleotide-binding oligomerization domain-containing protein 2
Synonyms:
CARD15 IBD1 NOD2 Nucleotide-binding oligomerization domain-containing protein 2 | nucleotide-binding oligomerization domain containing 2
Type:
PROTEIN
Mol. Mass.:
115287.18
Organism:
Homo sapiens (Human)
Description:
ChEMBL_1454053
Residue:
1040
  
Inhibitor
Name:
BDBM50227494
Synonyms:
CHEMBL257286 N-Quinolin-8-yl-benzenesulfonamide | cid_161167
Type:
Small organic molecule
Emp. Form.:
C15H12N2O2S
Mol. Mass.:
284.333
SMILES:
O=S(=O)(Nc1cccc2cccnc12)c1ccccc1
: