Target
Nucleotide-binding oligomerization domain-containing protein 2
Ligand
BDBM54518
Substrate
Meas. Tech.
uHTS luminescence assay for the identification of compounds that inhibit NOD2 in MDP treated cells
IC50
1928±n/a nM
Citation
 PubChem, PC uHTS luminescence assay for the identification of compounds that inhibit NOD2 in MDP treated cells PubChem Bioassay (2010)[AID] 
Target
Name:
Nucleotide-binding oligomerization domain-containing protein 2
Synonyms:
CARD15 IBD1 NOD2 Nucleotide-binding oligomerization domain-containing protein 2 | nucleotide-binding oligomerization domain containing 2
Type:
PROTEIN
Mol. Mass.:
115287.18
Organism:
Homo sapiens (Human)
Description:
ChEMBL_1454053
Residue:
1040
  
Inhibitor
Name:
BDBM54518
Synonyms:
2-[(4-keto-5-phenyl-3H-thieno[2,3-d]pyrimidin-2-yl)thio]-N-phenyl-acetamide 2-[(4-oxo-5-phenyl-3H-thieno[2,3-d]pyrimidin-2-yl)sulfanyl]-N-phenylacetamide MLS001034138 cid_2223437
Type:
Small organic molecule
Emp. Form.:
C20H15N3O2S2
Mol. Mass.:
393.482
SMILES:
O=C(CSc1nc2scc(-c3ccccc3)c2c(=O)[nH]1)Nc1ccccc1
: