Target
SUMO-conjugating enzyme UBC9
Ligand
BDBM47968
Substrate
Meas. Tech.
AlphaScreen confirmatory assay for validation of inhibitors of SUMOylation
IC50
1340±n/a nM
Citation
 PubChem, PC AlphaScreen confirmatory assay for validation of inhibitors of SUMOylation PubChem Bioassay (2010)[AID] 
Target
Name:
SUMO-conjugating enzyme UBC9
Synonyms:
UBC9 UBCE9 ubiquitin-conjugating enzyme E2I
Type:
Enzyme Catalytic Domain
Mol. Mass.:
18011.66
Organism:
Homo sapiens (Human)
Description:
gi_4507785
Residue:
158
  
Inhibitor
Name:
BDBM47968
Synonyms:
MLS000686315 N-[4-[(1-oxidanylidene-4-thiophen-2-ylsulfonylimino-naphthalen-2-yl)amino]phenyl]ethanamide N-[4-[(1-oxo-4-thiophen-2-ylsulfonyliminonaphthalen-2-yl)amino]phenyl]acetamide N-[4-[[1-keto-4-(2-thienylsulfonylimino)-2-naphthyl]amino]phenyl]acetamide cid_3715121
Type:
Small organic molecule
Emp. Form.:
C22H17N3O4S2
Mol. Mass.:
451.518
SMILES:
CC(=O)Nc1ccc(NC2=CC(=NS(=O)(=O)c3cccs3)c3ccccc3C2=O)cc1
: