Target
SUMO-conjugating enzyme UBC9
Ligand
BDBM61224
Substrate
Meas. Tech.
AlphaScreen confirmatory assay for validation of inhibitors of SUMOylation
IC50
1410±n/a nM
Citation
 PubChem, PC AlphaScreen confirmatory assay for validation of inhibitors of SUMOylation PubChem Bioassay (2010)[AID] 
Target
Name:
SUMO-conjugating enzyme UBC9
Synonyms:
UBC9 UBCE9 ubiquitin-conjugating enzyme E2I
Type:
Enzyme Catalytic Domain
Mol. Mass.:
18011.66
Organism:
Homo sapiens (Human)
Description:
gi_4507785
Residue:
158
  
Inhibitor
Name:
BDBM61224
Synonyms:
1-(2,4-dichlorophenyl)-3-[[(E)-(3-nitro-6-oxidanylidene-cyclohexa-2,4-dien-1-ylidene)methyl]amino]thiourea 1-(2,4-dichlorophenyl)-3-[[(E)-(3-nitro-6-oxocyclohexa-2,4-dien-1-ylidene)methyl]amino]thiourea MLS000777079 cid_5785332
Type:
Small organic molecule
Emp. Form.:
C14H10Cl2N4O3S
Mol. Mass.:
385.225
SMILES:
[O-][N+](=O)c1ccc(=O)[c-](C=[NH+]NC(=S)Nc2ccc(Cl)cc2Cl)c1
: