Target
Cell division control protein 42 homolog
Ligand
BDBM54613
Substrate
Meas. Tech.
Pyrazoline SAR compounds tested via Multiplex dose response to identify specific small molecule inhibitors of Ras and Ras-related GTPases specifically Cdc42 activated mutant
EC50
30000±n/a nM
Citation
 PubChem, PC Pyrazoline SAR compounds tested via Multiplex dose response to identify specific small molecule inhibitors of Ras and Ras-related GTPases specifically Cdc42 activated mutant PubChem Bioassay (2009)[AID] 
Target
Name:
Cell division control protein 42 homolog
Synonyms:
CDC42 Cell division control protein 42 homolog cell division cycle 42 (GTP binding protein, 25kDa)
Type:
PROTEIN
Mol. Mass.:
21258.36
Organism:
Homo sapiens (Human)
Description:
ChEMBL_652970
Residue:
191
  
Inhibitor
Name:
BDBM54613
Synonyms:
3-(4-methoxyphenyl)-2-(4-nitrophenyl)-5-phenyl-3,4-dihydropyrazole UNM-0000305852 | cid_2865225
Type:
Small organic molecule
Emp. Form.:
C22H19N3O3
Mol. Mass.:
373.4046
SMILES:
COc1ccc(cc1)C1C[C-](N=[N+]1c1ccc(cc1)[N+]([O-])=O)c1ccccc1
: