Target
Transient receptor potential M8 protein
Ligand
BDBM241636
Substrate
Meas. Tech.
Canine TRPM8 Functional Assay
Temperature
298.15±n/a K
IC50
0.840±n/a nM
Comments
extracted
Citation
 Player, MRCalvo, RChen, JMeegalla, SParks, DJParsons, WJBallentine, SBranum, S Substituted aza-bicyclic imidazole derivatives useful TRPM8 receptor modulators US Patent  US9718820 Publication Date 8/1/2017 
Target
Name:
Transient receptor potential M8 protein
Synonyms:
Cold-menthol receptor (TRPM8) Transient receptor potential M8 protein Transient receptor potential melastatin subfamily, type 8 (TRPM8)
Type:
Enzyme
Mol. Mass.:
127589.43
Organism:
Canis lupus familiaris (Dog)
Description:
Q1A7N1
Residue:
1104
  
Inhibitor
Name:
BDBM241636
Synonyms:
US9409915, 19 | US9718820, Compound 19
Type:
Small organic molecule
Emp. Form.:
C23H20ClF6N5O
Mol. Mass.:
531.881
SMILES:
Cn1nc(c(Cl)c1-c1nc2cc(nc(OCC(F)(F)F)c2[nH]1)-c1ccccc1C(F)(F)F)C(C)(C)C
: