Target
Gamma-aminobutyric acid receptor subunit alpha-5
Ligand
BDBM400239
Substrate
Meas. Tech.
Binding Assay
Ki
4.10±n/a nM
Citation
 Saito, THigashino, MKawaharada, SLewis, AChambers, MSRae, AHirst, KLHartley, CD Fused imidazole compounds US Patent  US10016439 Publication Date 7/10/2018 
Target
Name:
Gamma-aminobutyric acid receptor subunit alpha-5
Synonyms:
GABA receptor alpha-5 subunit GABRA5 Gamma-aminobutyric acid receptor subunit alpha-5 (GABA(A)) | Gamma-aminobutyric acid receptor subunit alpha-5 (GABAA)
Type:
Enzyme
Mol. Mass.:
52160.59
Organism:
Homo sapiens (Human)
Description:
P31644
Residue:
462
  
Inhibitor
Name:
BDBM400239
Synonyms:
7-((1-(2-Cyclopropylethyl)-5-fluoro-1H-benzo[d]imidazol-6-yl)amino)-4-methyl-2H-pyrido[3,2-b][1,4]oxazin-3(4H)-one | US10016439, 67
Type:
Small organic molecule
Emp. Form.:
C20H20FN5O2
Mol. Mass.:
381.4035
SMILES:
CN1C(=O)COc2cc(Nc3cc4n(CCC5CC5)cnc4cc3F)cnc12
: