Target
Tyrosine-protein kinase BTK
Ligand
BDBM267712
Substrate
Meas. Tech.
Btk Enzyme Activity Assay A
pH
7.2±n/a
Temperature
298.15±n/a K
EC50
<10.00±n/a nM
Comments
extracted
Citation
Target
Name:
Tyrosine-protein kinase BTK
Synonyms:
AGMX1 Agammaglobulinaemia tyrosine kinase B cell progenitor kinase BPK BTK_HUMAN Tyrosine Kinase BTK Tyrosine-protein kinase BTK (BTK)
Type:
Enzyme
Mol. Mass.:
76289.95
Organism:
Homo sapiens (Human)
Description:
Q06187
Residue:
659
  
Inhibitor
Name:
BDBM267712
Synonyms:
(E)-4-(8-amino-5-styryl-3-(tetrahydro-2H-pyran-4-yl)imidazo[1,5-a]pyrazin-1-yl)-N-(pyridin-2-yl) benzamide | US9718828, Example, 314
Type:
Small organic molecule
Emp. Form.:
C27H25ClF3N7O4
Mol. Mass.:
603.98
SMILES:
COCCC(=O)N1CCOC(C1)c1nc(-c2ccc(cc2)C(=O)Nc2cc(ccn2)C(F)(F)F)c2c(N)ncc(Cl)n12
: