Target
Induced myeloid leukemia cell differentiation protein Mcl-1
Ligand
BDBM46302
Substrate
Meas. Tech.
Confirmation dose response of hits from multiplexed high-throughput screen for small molecule regulators of Bcl-2 family protein interactions, specifically Bim-Mcl-1
EC50
3180±n/a nM
Citation
 PubChem, PC Confirmation dose response of hits from multiplexed high-throughput screen for small molecule regulators of Bcl-2 family protein interactions, specifically Bim-Mcl-1 PubChem Bioassay (2009)[AID] 
Target
Name:
Induced myeloid leukemia cell differentiation protein Mcl-1
Synonyms:
BCL2L3 Bcl-2-like protein 3 (Mcl-1) Bcl2-L-3 MCL1 Mcl-1 Myeloid cell leukemia sequence 1 (BCL2-related) | mcl1/EAT
Type:
Membrane; Single-pass membrane protein
Mol. Mass.:
37332.87
Organism:
Homo sapiens (Human)
Description:
Q07820
Residue:
350
  
Inhibitor
Name:
BDBM46302
Synonyms:
MLS000083668 cid_666339
Type:
Small organic molecule
Emp. Form.:
C26H25N5O4
Mol. Mass.:
471.5078
SMILES:
O=C1NC(=O)C2(Cc3c(nc4ccccn4c3=O)N3CCCCCC23)C(=O)N1Cc1ccccc1
: