Target
Amyloid-beta A4 precursor protein-binding family A member 1
Ligand
BDBM54742
Substrate
Meas. Tech.
uHTS Homogeneous Terbium Time-Resolved Fluorescence Resonance Energy Transfer (HTRF) Assay
IC50
2190±n/a nM
Citation
 PubChem, PC uHTS Homogeneous Terbium Time-Resolved Fluorescence Resonance Energy Transfer (HTRF) Assay PubChem Bioassay (2009)[AID] 
Target
Name:
Amyloid-beta A4 precursor protein-binding family A member 1
Synonyms:
APBA1_RAT Mint1 neuronal munc18-1 binding protein
Type:
Enzyme Catalytic Domain
Mol. Mass.:
92603.32
Organism:
Rattus norvegicus
Description:
gi_2625023
Residue:
839
  
Inhibitor
Name:
BDBM54742
Synonyms:
(E)-N-[4-(acetylsulfamoyl)phenyl]-3-(5-methyl-2-furanyl)-2-propenamide (E)-N-[4-(acetylsulfamoyl)phenyl]-3-(5-methylfuran-2-yl)prop-2-enamide MLS000626826 SMR000299218 | cid_896697
Type:
Small organic molecule
Emp. Form.:
C16H16N2O5S
Mol. Mass.:
348.374
SMILES:
CC(=O)NS(=O)(=O)c1ccc(NC(=O)\C=C\c2ccc(C)o2)cc1
: