Target
Amyloid-beta A4 precursor protein-binding family A member 1
Ligand
BDBM50582
Substrate
Meas. Tech.
uHTS Homogeneous Terbium Time-Resolved Fluorescence Resonance Energy Transfer (HTRF) Assay
IC50
3760±n/a nM
Citation
 PubChem, PC uHTS Homogeneous Terbium Time-Resolved Fluorescence Resonance Energy Transfer (HTRF) Assay PubChem Bioassay (2009)[AID] 
Target
Name:
Amyloid-beta A4 precursor protein-binding family A member 1
Synonyms:
APBA1_RAT Mint1 neuronal munc18-1 binding protein
Type:
Enzyme Catalytic Domain
Mol. Mass.:
92603.32
Organism:
Rattus norvegicus
Description:
gi_2625023
Residue:
839
  
Inhibitor
Name:
BDBM50582
Synonyms:
2-(2-furanyl)-N-[4-methoxy-3-(4-morpholinylsulfonyl)phenyl]-4-quinolinecarboxamide 2-(furan-2-yl)-N-(4-methoxy-3-morpholin-4-ylsulfonyl-phenyl)quinoline-4-carboxamide MLS001002794 cid_3612347
Type:
Small organic molecule
Emp. Form.:
C25H23N3O6S
Mol. Mass.:
493.532
SMILES:
COc1ccc(NC(=O)c2cc(nc3ccccc23)-c2ccco2)cc1S(=O)(=O)N1CCOCC1
: