Target
Serine/threonine-protein kinase ATR
Ligand
BDBM268050
Substrate
Meas. Tech.
Time-Resolved Fluorescence Energy Transfer (TR-FRET Tracer A)
pH
7±n/a
IC50
4.90±n/a nM
Comments
extracted
Citation
 Wortmann, LLücking, ULefranc, JBriem, HVon Nussbaum, FBader, BSiemeister, GBone, WLienau, PMoosmayer, DEberspächer, USchick, HEis, KKoppitz, MWengner, AMGrudzinska-Goebel, J 2-(morpholin-4-yl)-1,7-naphthyridines US Patent  US9549932 Publication Date 1/24/2017 
Target
Name:
Serine/threonine-protein kinase ATR
Synonyms:
ATR Ataxia telangiectasia and Rad3-related protein (ATR) FRP1 | Serine-protein kinase ATR
Type:
Protein
Mol. Mass.:
301404.58
Organism:
Homo sapiens (Human)
Description:
Q13535
Residue:
2644
  
Inhibitor
Name:
BDBM268050
Synonyms:
2-[(3R)-3-methylmorpholin-4-yl]-4-[4-(methylsulfonyl)piperazin-1-yl]-8-(1H-pyrazol-5-yl)-1,7-naphthyridine | US9549932, 82
Type:
Small organic molecule
Emp. Form.:
C26H35N7O4S
Mol. Mass.:
541.666
SMILES:
C[C@@H]1COCCN1c1cc(N2CCN(CC2)S(C)(=O)=O)c2ccnc(-c3ccnn3C3CCCCO3)c2n1
: