Target
Serine/threonine-protein kinase ATR
Ligand
BDBM268208
Substrate
Meas. Tech.
Time-Resolved Fluorescence Energy Transfer (TR-FRET Tracer A)
pH
7±n/a
IC50
4.06±n/a nM
Comments
extracted
Citation
 Wortmann, LLücking, ULefranc, JBriem, HVon Nussbaum, FBader, BSiemeister, GBone, WLienau, PMoosmayer, DEberspächer, USchick, HEis, KKoppitz, MWengner, AMGrudzinska-Goebel, J 2-(morpholin-4-yl)-1,7-naphthyridines US Patent  US9549932 Publication Date 1/24/2017 
Target
Name:
Serine/threonine-protein kinase ATR
Synonyms:
ATR Ataxia telangiectasia and Rad3-related protein (ATR) FRP1 | Serine-protein kinase ATR
Type:
Protein
Mol. Mass.:
301404.58
Organism:
Homo sapiens (Human)
Description:
Q13535
Residue:
2644
  
Inhibitor
Name:
BDBM268208
Synonyms:
US10772893, Example 241 US9549932, 241
Type:
Small organic molecule
Emp. Form.:
C21H25N5OS
Mol. Mass.:
395.521
SMILES:
C[C@@H]1COCCN1c1cc(C2CCSCC2)c2ccnc(-c3ccn[nH]3)c2n1
: