Target
Serine/threonine-protein kinase ATR
Ligand
BDBM268367
Substrate
Meas. Tech.
Time-Resolved Fluorescence Energy Transfer (TR-FRET Tracer A)
pH
7±n/a
IC50
299±n/a nM
Comments
extracted
Citation
 Wortmann, LLücking, ULefranc, JBriem, HVon Nussbaum, FBader, BSiemeister, GBone, WLienau, PMoosmayer, DEberspächer, USchick, HEis, KKoppitz, MWengner, AMGrudzinska-Goebel, J 2-(morpholin-4-yl)-1,7-naphthyridines US Patent  US9549932 Publication Date 1/24/2017 
Target
Name:
Serine/threonine-protein kinase ATR
Synonyms:
ATR Ataxia telangiectasia and Rad3-related protein (ATR) FRP1 | Serine-protein kinase ATR
Type:
Protein
Mol. Mass.:
301404.58
Organism:
Homo sapiens (Human)
Description:
Q13535
Residue:
2644
  
Inhibitor
Name:
BDBM268367
Synonyms:
3-[2-(morpholin-4-yl)-8-(1H- pyrazol-5-yl)-1,7-naphthyridin-4- yl]pyridin-2-amine US11529356, Example 402 | US9549932, 402
Type:
Small organic molecule
Emp. Form.:
C20H19N7O
Mol. Mass.:
373.4112
SMILES:
Nc1ncccc1-c1cc(nc2c(nccc12)-c1ccn[nH]1)N1CCOCC1
: