Target
Neutrophil cytosol factor 1 [S99G]
Ligand
BDBM51888
Substrate
Meas. Tech.
Dose Response Confirmation for small molecular inhibitors for p47phox, a regulatory protein of NADPH oxidases (Noxs)
IC50
50000±n/a nM
Citation
 PubChem, PC Dose Response Confirmation for small molecular inhibitors for p47phox, a regulatory protein of NADPH oxidases (Noxs) PubChem Bioassay (2008)[AID] 
Target
Name:
Neutrophil cytosol factor 1 [S99G]
Synonyms:
NCF1 NOXO2 neutrophil cytosolic factor 1
Type:
Enzyme Catalytic Domain
Mol. Mass.:
44664.39
Organism:
Homo sapiens (Human)
Description:
gi_115298672
Residue:
390
  
Inhibitor
Name:
BDBM51888
Synonyms:
MLS000562858 YW-IY | cid_16745383
Type:
Small organic molecule
Emp. Form.:
C57H74ClN17O7
Mol. Mass.:
1144.76
SMILES:
Cl.CCC(C)[C@H](N)c1cn(nn1)[C@@H](Cc1ccc(O)cc1)C(=O)N1CCN(CC1)c1nc(NCCOCCOCCOCC#C)nc(n1)N1CCN(CC1)C(=O)[C@H](Cc1cc2ccccc2[nH]1)n1cc(nn1)[C@@H](N)Cc1ccc(O)cc1
: