Target
Streptokinase A
Ligand
BDBM57090
Substrate
Meas. Tech.
Absorbance Microorganism-Based Dose Response HTS to Identify Inhibitors of Streptokinase Expression
EC50
12868±n/a nM
Citation
 PubChem, PC Absorbance Microorganism-Based Dose Response HTS to Identify Inhibitors of Streptokinase Expression PubChem Bioassay (2009)[AID] 
Target
Name:
Streptokinase A
Synonyms:
STRP_STRP1 streptokinase A precursor
Type:
Enzyme Catalytic Domain
Mol. Mass.:
49924.80
Organism:
Streptococcus pyogenes M1 GAS
Description:
gi_15675770
Residue:
440
  
Inhibitor
Name:
BDBM57090
Synonyms:
2,2-bis(phenylmethyl)-3H-inden-1-one 2,2-dibenzyl-3H-inden-1-one MLS000548521 cid_1216323
Type:
Small organic molecule
Emp. Form.:
C23H20O
Mol. Mass.:
312.4043
SMILES:
O=C1c2ccccc2CC1(Cc1ccccc1)Cc1ccccc1
: