Target
Streptokinase A
Ligand
BDBM57624
Substrate
Meas. Tech.
Absorbance Microorganism-Based Dose Response HTS to Identify Inhibitors of Streptokinase Expression
EC50
150000±n/a nM
Citation
 PubChem, PC Absorbance Microorganism-Based Dose Response HTS to Identify Inhibitors of Streptokinase Expression PubChem Bioassay (2009)[AID] 
Target
Name:
Streptokinase A
Synonyms:
STRP_STRP1 streptokinase A precursor
Type:
Enzyme Catalytic Domain
Mol. Mass.:
49924.80
Organism:
Streptococcus pyogenes M1 GAS
Description:
gi_15675770
Residue:
440
  
Inhibitor
Name:
BDBM57624
Synonyms:
MLS000393625 N-(1H-benzimidazol-2-yl)-3-[methyl-(4-methylphenyl)sulfamoyl]benzamide cid_2126544
Type:
Small organic molecule
Emp. Form.:
C22H20N4O3S
Mol. Mass.:
420.484
SMILES:
CN(c1ccc(C)cc1)S(=O)(=O)c1cccc(c1)C(=O)Nc1nc2ccccc2[nH]1
: