Target
Streptokinase A
Ligand
BDBM57929
Substrate
Meas. Tech.
Absorbance Microorganism-Based Dose Response HTS to Identify Inhibitors of Streptokinase Expression
EC50
150000±n/a nM
Citation
 PubChem, PC Absorbance Microorganism-Based Dose Response HTS to Identify Inhibitors of Streptokinase Expression PubChem Bioassay (2009)[AID] 
Target
Name:
Streptokinase A
Synonyms:
STRP_STRP1 streptokinase A precursor
Type:
Enzyme Catalytic Domain
Mol. Mass.:
49924.80
Organism:
Streptococcus pyogenes M1 GAS
Description:
gi_15675770
Residue:
440
  
Inhibitor
Name:
BDBM57929
Synonyms:
2-[4-({[3-(ethoxycarbonyl)phenyl]amino}carbonothioyl)piperazin-1-yl]-8-ethyl-5-oxo-5,8-dihydropyrido[2,3-d]pyrimidine-6-carboxylic acid 2-[4-[(3-ethoxycarbonylanilino)-sulfanylidenemethyl]-1-piperazinyl]-8-ethyl-5-oxo-6-pyrido[2,3-d]pyrimidinecarboxylic acid 2-[4-[(3-ethoxycarbonylphenyl)carbamothioyl]piperazin-1-yl]-8-ethyl-5-oxopyrido[2,3-d]pyrimidine-6-carboxylic acid SMR000313320 | cid_4439653
Type:
Small organic molecule
Emp. Form.:
C24H26N6O5S
Mol. Mass.:
510.565
SMILES:
CCOC(=O)c1cccc(NC(=S)N2CCN(CC2)c2ncc3c(n2)n(CC)cc(C(O)=O)c3=O)c1
: